Reaction Details
TargetPenicillin-binding protein 1A
LigandBDBM50012180
Substrate/Competitorn/a
Meas. Tech.ChEMBL_1353117 (CHEMBL3271797)
IC50 46±n/a nM
Citation Starr, JBrown, MFAschenbrenner, LCaspers, NChe, YGerstenberger, BSHuband, MKnafels, JDLemmon, MMLi, CMcCurdy, SPMcElroy, ERauckhorst, MRTomaras, APYoung, JAZaniewski, RPShanmugasundaram, VHan, S Siderophore receptor-mediated uptake of lactivicin analogues in gram-negative bacteria. J Med Chem57:3845-55 (2014) 
 
Penicillin-binding protein 1A
Name:Penicillin-binding protein 1A
Type:PROTEIN
Mol. Mass.:91195.42
Organism:Pseudomonas aeruginosa PAO1
Description:ChEMBL_108353
Residue:822
BDBM50012180
NameBDBM50012180
Synonyms:CHEMBL3265224
TypeSmall organic molecule
Emp. Form.C23H23N7O14S
Mol. Mass.653.532
SMILESCC(C)(O\N=C(/C(=O)N[C@H]1CON(C1=O)C1(C[C@@H](NC(=O)c2cc(=O)c(O)cn2O)C(=O)O1)C(O)=O)c1csc(N)n1)C(O)=O