Reaction Details
TargetPenicillin-binding protein 1A
LigandBDBM50012182
Substrate/Competitorn/a
Meas. Tech.ChEMBL_1353117 (CHEMBL3271797)
IC50 65±n/a nM
Citation Starr, JBrown, MFAschenbrenner, LCaspers, NChe, YGerstenberger, BSHuband, MKnafels, JDLemmon, MMLi, CMcCurdy, SPMcElroy, ERauckhorst, MRTomaras, APYoung, JAZaniewski, RPShanmugasundaram, VHan, S Siderophore receptor-mediated uptake of lactivicin analogues in gram-negative bacteria. J Med Chem57:3845-55 (2014) 
 
Penicillin-binding protein 1A
Name:Penicillin-binding protein 1A
Type:PROTEIN
Mol. Mass.:91195.42
Organism:Pseudomonas aeruginosa PAO1
Description:ChEMBL_108353
Residue:822
BDBM50012182
NameBDBM50012182
Synonyms:CHEMBL3265223
TypeSmall organic molecule
Emp. Form.C25H26N6O12S
Mol. Mass.634.572
SMILESCC(C)(O\N=C(/C(=O)N[C@H]1CON(C1=O)C1(C[C@H](NC(=O)OCc2ccccc2)C(=O)O1)C(O)=O)c1csc(N)n1)C(O)=O