Reaction Details
TargetNuclear receptor ROR-gamma
LigandBDBM19993
Substrate/Competitorn/a
Meas. Tech.ChEMBL_1351232 (CHEMBL3271687)
IC50 6500±n/a nM
Citation Nishiyama, YNakamura, MMisawa, TNakagomi, MMakishima, MIshikawa, MHashimoto, Y Structure-activity relationship-guided development of retinoic acid receptor-related orphan receptor gamma (ROR¿)-selective inverse agonists with a phenanthridin-6(5H)-one skeleton from a liver X receptor ligand. Bioorg Med Chem22:2799-808 (2014) 
 
Nuclear receptor ROR-gamma
Name:Nuclear receptor ROR-gamma
Type:Enzyme Catalytic Domain
Mol. Mass.:58218.40
Organism:Homo sapiens (Human)
Description:P51449
Residue:518
BDBM19993
NameBDBM19993
Synonyms:CHEMBL62136 T 0901317 TO-901317 US10669296, Compound TO901317 [3H]T0901317
TypeSmall organic molecule
Emp. Form.C17H12F9NO3S
Mol. Mass.481.333
SMILESOC(c1ccc(cc1)N(CC(F)(F)F)S(=O)(=O)c1ccccc1)(C(F)(F)F)C(F)(F)F