Reaction Details
TargetDual specificity protein phosphatase 3
LigandBDBM50012323
Substrate/Competitorn/a
Meas. Tech.ChEMBL_1351244 (CHEMBL3271699)
IC50 4600±n/a nM
Citation Thuaud, FKojima, SHirai, GOonuma, KTsuchiya, AUchida, TTsuchimoto, TSodeoka, M RE12 derivatives displaying Vaccinia H1-related phosphatase (VHR) inhibition in the presence of detergent and their anti-proliferative activity against HeLa cells. Bioorg Med Chem22:2771-82 (2014) 
 
Dual specificity protein phosphatase 3
Name:Dual specificity protein phosphatase 3
Type:Hydrolase
Mol. Mass.:20480.58
Organism:Homo sapiens (Human)
Description:n/a
Residue:185
BDBM50012323
NameBDBM50012323
Synonyms:CHEMBL3260378
TypeSmall organic molecule
Emp. Form.C31H32ClNO5
Mol. Mass.534.042
SMILESCc1cccc(CN\C(CCCCc2ccc(OCc3ccc(Cl)cc3)cc2)=C2/C(=O)OC(CO)C2=O)c1