Reaction Details
TargetE3 ubiquitin-protein ligase Mdm2
LigandBDBM50012593
Substrate/Competitorn/a
Meas. Tech.ChEMBL_1351457 (CHEMBL3267322)
IC50 6.0±n/a nM
Citation Vaupel, ABold, GDe Pover, AStachyra-Valat, THergovich-Lisztwan, JKallen, JMasuya, KFuret, P Tetra-substituted imidazoles as a new class of inhibitors of the p53-MDM2 interaction. Bioorg Med Chem Lett24:2110-4 (2014) 
 
E3 ubiquitin-protein ligase Mdm2
Name:E3 ubiquitin-protein ligase Mdm2
Type:Oncoprotein
Mol. Mass.:55196.54
Organism:Homo sapiens (Human)
Description:Q00987
Residue:491
BDBM50012593
NameBDBM50012593
Synonyms:CHEMBL3260820
TypeSmall organic molecule
Emp. Form.C31H26Cl2F2N6O2
Mol. Mass.623.48
SMILESNc1nnc(o1)-c1nc(C2CCCCC2)n(c1-c1ccc(F)c(Cl)c1)-c1c(CC(=O)Nc2ccccc2)ccc(Cl)c1F