Reaction Details
TargetBeta-secretase 1
LigandBDBM50012660
Substrate/Competitorn/a
Meas. Tech.ChEMBL_1351647 (CHEMBL3269334)
IC50 1.000000±n/a nM
Citation Oehlrich, DProkopcova, HGijsen, HJ The evolution of amidine-based brain penetrant BACE1 inhibitors. Bioorg Med Chem Lett24:2033-45 (2014) 
 
Beta-secretase 1
Name:Beta-secretase 1
Type:Protein
Mol. Mass.:55755.10
Organism:Homo sapiens (Human)
Description:P56817
Residue:501
BDBM50012660
NameBDBM50012660
Synonyms:CHEMBL3261078 US9556135, 19
TypeSmall organic molecule
Emp. Form.C19H20ClFN4O3S
Mol. Mass.438.904
SMILESCC1(C)C(N)=N[C@@](C)(CS1(=O)=O)c1cc(NC(=O)c2ccc(Cl)cn2)ccc1F