Reaction Details
TargetCytochrome P450 3A5
LigandBDBM50012905
Substrate/Competitorn/a
Meas. Tech.ChEMBL_1351970 (CHEMBL3266607)
IC50>50000±n/a nM
Citation Kelly, MJPietranico-Cole, SLarigan, JDHaynes, NEReynolds, CHScott, NVermeulen, JDvorozniak, MConde-Knape, KHuang, KSSo, SSThakkar, KQian, YBanner, BMennona, FDanzi, SKlein, ITaub, RTilley, J Discovery of 2-[3,5-dichloro-4-(5-isopropyl-6-oxo-1,6-dihydropyridazin-3-yloxy)phenyl]-3,5-dioxo-2,3,4,5-tetrahydro[1,2,4]triazine-6-carbonitrile (MGL-3196), a Highly Selective Thyroid Hormone Receptorß agonist in clinical trials for the treatment of dyslipidemia. J Med Chem57:3912-23 (2014) 
 
Cytochrome P450 3A5
Name:Cytochrome P450 3A5
Type:Protein
Mol. Mass.:57118.00
Organism:Homo sapiens (Human)
Description:P20815
Residue:502
BDBM50012905
NameBDBM50012905
Synonyms:CHEMBL3261331 | USRE46024, 8
TypeSmall organic molecule
Emp. Form.C17H12Cl2N6O4
Mol. Mass.435.221
SMILESCC(C)c1cc(Oc2c(Cl)cc(cc2Cl)-n2nc(C#N)c(=O)[nH]c2=O)n[nH]c1=O