Reaction Details
TargetP2Y purinoceptor 2
LigandBDBM50012953
Substrate/Competitorn/a
Meas. Tech.ChEMBL_1351702 (CHEMBL3270102)
EC50 299±n/a nM
Citation Jayasekara, PSBarrett, MOBall, CBBrown, KAHammes, EBalasubramanian, RHarden, TKJacobson, KA 4-Alkyloxyimino derivatives of uridine-5'-triphosphate: distal modification of potent agonists as a strategy for molecular probes of P2Y2, P2Y4, and P2Y6 receptors. J Med Chem57:3874-83 (2014) 
 
P2Y purinoceptor 2
Name:P2Y purinoceptor 2
Type:PROTEIN
Mol. Mass.:42299.21
Organism:Homo sapiens (Human)
Description:ChEMBL_1455361
Residue:377
BDBM50012953
NameBDBM50012953
Synonyms:CHEMBL3261359
TypeSmall organic molecule
Emp. Form.C13H22N3O17P3
Mol. Mass.585.245
SMILESO[C@@H]1[C@@H](COP(O)(=O)OP(O)(=O)OP(O)(O)=O)O[C@H]([C@@H]1O)n1cc\c(=N\OCCCC(O)=O)[nH]c1=O