Reaction Details
TargetP2Y purinoceptor 2
LigandBDBM50012958
Substrate/Competitorn/a
Meas. Tech.ChEMBL_1351702 (CHEMBL3270102)
EC50 190±n/a nM
Citation Jayasekara, PSBarrett, MOBall, CBBrown, KAHammes, EBalasubramanian, RHarden, TKJacobson, KA 4-Alkyloxyimino derivatives of uridine-5'-triphosphate: distal modification of potent agonists as a strategy for molecular probes of P2Y2, P2Y4, and P2Y6 receptors. J Med Chem57:3874-83 (2014) 
 
P2Y purinoceptor 2
Name:P2Y purinoceptor 2
Type:PROTEIN
Mol. Mass.:42299.21
Organism:Homo sapiens (Human)
Description:ChEMBL_1455361
Residue:377
BDBM50012958
NameBDBM50012958
Synonyms:CHEMBL3261362
TypeSmall organic molecule
Emp. Form.C18H25FN3O15P3
Mol. Mass.635.3219
SMILESO[C@@H]1[C@@H](COP(O)(=O)OP(O)(=O)OP(O)(O)=O)O[C@H]([C@@H]1O)n1cc\c(=N\OCCCc2cccc(F)c2)[nH]c1=O