Reaction Details
TargetP2Y purinoceptor 4
LigandBDBM50012977
Substrate/Competitorn/a
Meas. Tech.ChEMBL_1351703 (CHEMBL3270103)
EC50 84±n/a nM
Citation Jayasekara, PSBarrett, MOBall, CBBrown, KAHammes, EBalasubramanian, RHarden, TKJacobson, KA 4-Alkyloxyimino derivatives of uridine-5'-triphosphate: distal modification of potent agonists as a strategy for molecular probes of P2Y2, P2Y4, and P2Y6 receptors. J Med Chem57:3874-83 (2014) 
 
P2Y purinoceptor 4
Name:P2Y purinoceptor 4
Type:PROTEIN
Mol. Mass.:40977.17
Organism:Homo sapiens (Human)
Description:ChEMBL_751027
Residue:365
BDBM50012977
NameBDBM50012977
Synonyms:CHEMBL3261368
TypeSmall organic molecule
Emp. Form.C18H25N4O17P3
Mol. Mass.662.329
SMILESO[C@@H]1[C@@H](COP(O)(=O)OP(O)(=O)OP(O)(O)=O)O[C@H]([C@@H]1O)n1cc\c(=N\OCCCc2ccc(cc2)[N+]([O-])=O)[nH]c1=O