Reaction Details
TargetP2Y purinoceptor 4
LigandBDBM50012978
Substrate/Competitorn/a
Meas. Tech.ChEMBL_1351703 (CHEMBL3270103)
EC50 23±n/a nM
Citation Jayasekara, PSBarrett, MOBall, CBBrown, KAHammes, EBalasubramanian, RHarden, TKJacobson, KA 4-Alkyloxyimino derivatives of uridine-5'-triphosphate: distal modification of potent agonists as a strategy for molecular probes of P2Y2, P2Y4, and P2Y6 receptors. J Med Chem57:3874-83 (2014) 
 
P2Y purinoceptor 4
Name:P2Y purinoceptor 4
Type:PROTEIN
Mol. Mass.:40977.17
Organism:Homo sapiens (Human)
Description:ChEMBL_751027
Residue:365
BDBM50012978
NameBDBM50012978
Synonyms:CHEMBL3261369
TypeSmall organic molecule
Emp. Form.C19H28N3O16P3
Mol. Mass.647.3574
SMILESCOc1ccc(CCCO\N=c2\ccn([C@@H]3O[C@H](COP(O)(=O)OP(O)(=O)OP(O)(O)=O)[C@@H](O)[C@H]3O)c(=O)[nH]2)cc1