Reaction Details
TargetP2Y purinoceptor 4
LigandBDBM50013028
Substrate/Competitorn/a
Meas. Tech.ChEMBL_1351703 (CHEMBL3270103)
EC50 200±n/a nM
Citation Jayasekara, PSBarrett, MOBall, CBBrown, KAHammes, EBalasubramanian, RHarden, TKJacobson, KA 4-Alkyloxyimino derivatives of uridine-5'-triphosphate: distal modification of potent agonists as a strategy for molecular probes of P2Y2, P2Y4, and P2Y6 receptors. J Med Chem57:3874-83 (2014) 
 
P2Y purinoceptor 4
Name:P2Y purinoceptor 4
Type:PROTEIN
Mol. Mass.:40977.17
Organism:Homo sapiens (Human)
Description:ChEMBL_751027
Residue:365
BDBM50013028
NameBDBM50013028
Synonyms:CHEMBL3261377
TypeSmall organic molecule
Emp. Form.C63H89N12O27P3S2
Mol. Mass.1603.496
SMILESCC[NH+](CC)CC.CC[NH+](CC)CC.Nc1ccc2c(-c3ccc(cc3C([O-])=O)C(=O)NCCCCCCn3cc(CCNC(=O)COc4ccc(CCCO\N=c5\ccn([C@@H]6O[C@H](COP(O)(=O)OP(O)(=O)OP(O)(O)=O)[C@@H](O)[C@H]6O)c(=O)[nH]5)cc4)nn3)c3ccc(=[NH2+])c(c3oc2c1S([O-])(=O)=O)S([O-])(=O)=O