Reaction Details
TargetP2Y purinoceptor 6
LigandBDBM50012975
Substrate/Competitorn/a
Meas. Tech.ChEMBL_1351704 (CHEMBL3270104)
EC50 90±n/a nM
Citation Jayasekara, PSBarrett, MOBall, CBBrown, KAHammes, EBalasubramanian, RHarden, TKJacobson, KA 4-Alkyloxyimino derivatives of uridine-5'-triphosphate: distal modification of potent agonists as a strategy for molecular probes of P2Y2, P2Y4, and P2Y6 receptors. J Med Chem57:3874-83 (2014) 
 
P2Y purinoceptor 6
Name:P2Y purinoceptor 6
Type:PROTEIN
Mol. Mass.:36452.29
Organism:Homo sapiens (Human)
Description:ChEMBL_1511151
Residue:328
BDBM50012975
NameBDBM50012975
Synonyms:CHEMBL3261366
TypeSmall organic molecule
Emp. Form.C18H25IN3O15P3
Mol. Mass.743.228
SMILESO[C@@H]1[C@@H](COP(O)(=O)OP(O)(=O)OP(O)(O)=O)O[C@H]([C@@H]1O)n1cc\c(=N\OCCCc2ccc(I)cc2)[nH]c1=O