Reaction Details
TargetMacrophage migration inhibitory factor
LigandBDBM50013032
Substrate/Competitorn/a
Meas. Tech.ChEMBL_1351719 (CHEMBL3270119)
Ki 348±n/a nM
Citation Xu, LZhang, YZheng, LQiao, CLi, YLi, DZhen, XHou, T Discovery of novel inhibitors targeting the macrophage migration inhibitory factor via structure-based virtual screening and bioassays. J Med Chem57:3737-45 (2014) 
 
Macrophage migration inhibitory factor
Name:Macrophage migration inhibitory factor
Type:Enzyme
Mol. Mass.:12478.18
Organism:Homo sapiens (Human)
Description:P14174
Residue:115
BDBM50013032
NameBDBM50013032
Synonyms:CHEMBL1604170
TypeSmall organic molecule
Emp. Form.C21H16N2O3S
Mol. Mass.376.428
SMILESOC(=O)c1cccc(NC(=S)NC(=O)c2ccc(cc2)-c2ccccc2)c1