Reaction Details
TargetCarbonic anhydrase 1
LigandBDBM50004349
Substrate/Competitorn/a
Meas. Tech.ChEMBL_1351732 (CHEMBL3270521)
Ki>50000±n/a nM
Citation Mojzych, MBielawska, ABielawski, KCeruso, MSupuran, CT Pyrazolo[4,3-e][1,2,4]triazine sulfonamides as carbonic anhydrase inhibitors with antitumor activity. Bioorg Med Chem22:2643-7 (2014) 
 
Carbonic anhydrase 1
Name:Carbonic anhydrase 1
Type:Enzyme
Mol. Mass.:28873.37
Organism:Homo sapiens (Human)
Description:P00915
Residue:261
BDBM50004349
NameBDBM50004349
Synonyms:CHEMBL3237851
TypeSmall organic molecule
Emp. Form.C14H17N7O3S
Mol. Mass.363.395
SMILESCc1nn(C)c2nnc(Nc3ccc(cc3)S(=O)(=O)NCCO)nc12