Reaction Details
TargetCarbonic anhydrase 2
LigandBDBM50013049
Substrate/Competitorn/a
Meas. Tech.ChEMBL_1351733 (CHEMBL3270522)
Ki 826±n/a nM
Citation Mojzych, MBielawska, ABielawski, KCeruso, MSupuran, CT Pyrazolo[4,3-e][1,2,4]triazine sulfonamides as carbonic anhydrase inhibitors with antitumor activity. Bioorg Med Chem22:2643-7 (2014) 
 
Carbonic anhydrase 2
Name:Carbonic anhydrase 2
Type:Enzyme
Mol. Mass.:29250.71
Organism:Homo sapiens (Human)
Description:P00918
Residue:260
BDBM50013049
NameBDBM50013049
Synonyms:CHEMBL3261397
TypeSmall organic molecule
Emp. Form.C12H12N6
Mol. Mass.240.2639
SMILESCc1nn(C)c2nnc(Nc3ccccc3)nc12