Reaction Details
TargetCarbonic anhydrase 2
LigandBDBM50004344
Substrate/Competitorn/a
Meas. Tech.ChEMBL_1351733 (CHEMBL3270522)
Ki 719±n/a nM
Citation Mojzych, MBielawska, ABielawski, KCeruso, MSupuran, CT Pyrazolo[4,3-e][1,2,4]triazine sulfonamides as carbonic anhydrase inhibitors with antitumor activity. Bioorg Med Chem22:2643-7 (2014) 
 
Carbonic anhydrase 2
Name:Carbonic anhydrase 2
Type:Enzyme
Mol. Mass.:29250.71
Organism:Homo sapiens (Human)
Description:P00918
Residue:260
BDBM50004344
NameBDBM50004344
Synonyms:CHEMBL3237857
TypeSmall organic molecule
Emp. Form.C18H24N8O3S
Mol. Mass.432.5
SMILESCc1nn(C)c2nnc(Nc3ccc(cc3)S(=O)(=O)NCCN3CCOCC3)nc12