Reaction Details
TargetCarbonic anhydrase 9
LigandBDBM50004348
Substrate/Competitorn/a
Meas. Tech.ChEMBL_1351734 (CHEMBL3270523)
Ki>50000±n/a nM
Citation Mojzych, MBielawska, ABielawski, KCeruso, MSupuran, CT Pyrazolo[4,3-e][1,2,4]triazine sulfonamides as carbonic anhydrase inhibitors with antitumor activity. Bioorg Med Chem22:2643-7 (2014) 
 
Carbonic anhydrase 9
Name:Carbonic anhydrase 9
Type:Enzyme
Mol. Mass.:49669.03
Organism:Homo sapiens (Human)
Description:Catalytic domain of human cloned isozyme was used in the assay
Residue:459
BDBM50004348
NameBDBM50004348
Synonyms:CHEMBL3237850
TypeSmall organic molecule
Emp. Form.C16H20N8O2S
Mol. Mass.388.447
SMILESCc1nn(C)c2nnc(Nc3ccc(cc3)S(=O)(=O)N3CCNCC3)nc12