Reaction Details
TargetCarbonic anhydrase 9
LigandBDBM50004344
Substrate/Competitorn/a
Meas. Tech.ChEMBL_1351734 (CHEMBL3270523)
Ki 824±n/a nM
Citation Mojzych, MBielawska, ABielawski, KCeruso, MSupuran, CT Pyrazolo[4,3-e][1,2,4]triazine sulfonamides as carbonic anhydrase inhibitors with antitumor activity. Bioorg Med Chem22:2643-7 (2014) 
 
Carbonic anhydrase 9
Name:Carbonic anhydrase 9
Type:Enzyme
Mol. Mass.:49669.03
Organism:Homo sapiens (Human)
Description:Catalytic domain of human cloned isozyme was used in the assay
Residue:459
BDBM50004344
NameBDBM50004344
Synonyms:CHEMBL3237857
TypeSmall organic molecule
Emp. Form.C18H24N8O3S
Mol. Mass.432.5
SMILESCc1nn(C)c2nnc(Nc3ccc(cc3)S(=O)(=O)NCCN3CCOCC3)nc12