Reaction Details
TargetCarbonic anhydrase 12
LigandBDBM50004351
Substrate/Competitorn/a
Meas. Tech.ChEMBL_1351735 (CHEMBL3270524)
Ki 8.1±n/a nM
Citation Mojzych, MBielawska, ABielawski, KCeruso, MSupuran, CT Pyrazolo[4,3-e][1,2,4]triazine sulfonamides as carbonic anhydrase inhibitors with antitumor activity. Bioorg Med Chem22:2643-7 (2014) 
 
Carbonic anhydrase 12
Name:Carbonic anhydrase 12
Type:Enzyme
Mol. Mass.:39456.00
Organism:Homo sapiens (Human)
Description:Catalytic domain of human cloned isozyme was used in the assay
Residue:354
BDBM50004351
NameBDBM50004351
Synonyms:CHEMBL3233061
TypeSmall organic molecule
Emp. Form.C16H19N7O2S
Mol. Mass.373.433
SMILESCc1nn(C)c2nnc(Nc3ccc(cc3)S(=O)(=O)N3CCCC3)nc12