Reaction Details
TargetCarbonic anhydrase 12
LigandBDBM50004350
Substrate/Competitorn/a
Meas. Tech.ChEMBL_1351735 (CHEMBL3270524)
Ki 5.9±n/a nM
Citation Mojzych, MBielawska, ABielawski, KCeruso, MSupuran, CT Pyrazolo[4,3-e][1,2,4]triazine sulfonamides as carbonic anhydrase inhibitors with antitumor activity. Bioorg Med Chem22:2643-7 (2014) 
 
Carbonic anhydrase 12
Name:Carbonic anhydrase 12
Type:Enzyme
Mol. Mass.:39456.00
Organism:Homo sapiens (Human)
Description:Catalytic domain of human cloned isozyme was used in the assay
Residue:354
BDBM50004350
NameBDBM50004350
Synonyms:CHEMBL3237852
TypeSmall organic molecule
Emp. Form.C17H22N8O2S
Mol. Mass.402.474
SMILESCc1nn(C)c2nnc(Nc3ccc(cc3)S(=O)(=O)N3CCCNCC3)nc12