Reaction Details
TargetGeranylgeranyl pyrophosphate synthase
LigandBDBM50013158
Substrate/Competitorn/a
Meas. Tech.ChEMBL_1348038 (CHEMBL3268702)
IC50 23000±n/a nM
Citation Zhou, XFerree, SDWills, VSBorn, EJTong, HWiemer, DFHolstein, SA Geranyl and neryl triazole bisphosphonates as inhibitors of geranylgeranyl diphosphate synthase. Bioorg Med Chem22:2791-8 (2014) 
 
Geranylgeranyl pyrophosphate synthase
Name:Geranylgeranyl pyrophosphate synthase
Type:Homooctamer; transferase
Mol. Mass.:34867.94
Organism:Homo sapiens (Human)
Description:Recombinant human GGPPS was cloned and expressed in E. coli.
Residue:300
BDBM50013158
NameBDBM50013158
Synonyms:CHEMBL3262353
TypeSmall organic molecule
Emp. Form.C14H21N3Na4O7P2
Mol. Mass.497.239
SMILES[Na+].[Na+].[Na+].[Na+].[#6]\[#6](-[#6])=[#6]\[#6]-[#6][C@@]1([#6])[#8]-[#6@@H]1-[#6]-n1cc(-[#6]-[#6](P([#8-])([#8-])=O)P([#8-])([#8-])=O)nn1