Reaction Details
TargetTyrosine-protein kinase SYK
LigandBDBM50013160
Substrate/Competitorn/a
Meas. Tech.ChEMBL_1348049 (CHEMBL3268713)
IC50 778±n/a nM
Citation Thoma, GBlanz, JBühlmayer, PDrückes, PKittelmann, MSmith, ABvan Eis, MVangrevelinghe, EZerwes, HGChe, JJHe, XJin, YLee, CCMichellys, PYUno, TLiu, H Syk inhibitors with high potency in presence of blood. Bioorg Med Chem Lett24:2278-82 (2014) 
 
Tyrosine-protein kinase SYK
Name:Tyrosine-protein kinase SYK
Type:Enzyme
Mol. Mass.:72079.99
Organism:Homo sapiens (Human)
Description:P43405
Residue:635
BDBM50013160
NameBDBM50013160
Synonyms:CHEMBL3262355
TypeSmall organic molecule
Emp. Form.C21H23N9O
Mol. Mass.417.467
SMILESN[C@H]1CCCC[C@H]1Nc1cc2nc[nH]c(=O)c2c(Nc2cccc(c2)-n2nccn2)n1