Reaction Details
TargetTyrosine-protein kinase Lyn
LigandBDBM50013168
Substrate/Competitorn/a
Meas. Tech.ChEMBL_1348045 (CHEMBL3268709)
IC50 315±n/a nM
Citation Thoma, GBlanz, JBühlmayer, PDrückes, PKittelmann, MSmith, ABvan Eis, MVangrevelinghe, EZerwes, HGChe, JJHe, XJin, YLee, CCMichellys, PYUno, TLiu, H Syk inhibitors with high potency in presence of blood. Bioorg Med Chem Lett24:2278-82 (2014) 
 
Tyrosine-protein kinase Lyn
Name:Tyrosine-protein kinase Lyn
Type:Protein
Mol. Mass.:58575.92
Organism:Homo sapiens (Human)
Description:P07948
Residue:512
BDBM50013168
NameBDBM50013168
Synonyms:CHEMBL3262619
TypeSmall organic molecule
Emp. Form.C20H21N7O
Mol. Mass.375.427
SMILESO=c1[nH]cnc2cc(N[C@@H]3CCCNC3)nc(Nc3cccc4cc[nH]c34)c12