Reaction Details
TargetTyrosine-protein kinase Lyn
LigandBDBM50013170
Substrate/Competitorn/a
Meas. Tech.ChEMBL_1348045 (CHEMBL3268709)
IC50 190±n/a nM
Citation Thoma, GBlanz, JBühlmayer, PDrückes, PKittelmann, MSmith, ABvan Eis, MVangrevelinghe, EZerwes, HGChe, JJHe, XJin, YLee, CCMichellys, PYUno, TLiu, H Syk inhibitors with high potency in presence of blood. Bioorg Med Chem Lett24:2278-82 (2014) 
 
Tyrosine-protein kinase Lyn
Name:Tyrosine-protein kinase Lyn
Type:Protein
Mol. Mass.:58575.92
Organism:Homo sapiens (Human)
Description:P07948
Residue:512
BDBM50013170
NameBDBM50013170
Synonyms:CHEMBL3262622
TypeSmall organic molecule
Emp. Form.C21H23N7O2
Mol. Mass.405.453
SMILESCn1cc2c(Nc3nc(N[C@@H]4CCOC[C@@H]4N)cc4cc[nH]c(=O)c34)cccc2n1