Reaction Details
TargetTyrosine-protein kinase ZAP-70
LigandBDBM50013160
Substrate/Competitorn/a
Meas. Tech.ChEMBL_1348046 (CHEMBL3268710)
IC50 74±n/a nM
Citation Thoma, GBlanz, JBühlmayer, PDrückes, PKittelmann, MSmith, ABvan Eis, MVangrevelinghe, EZerwes, HGChe, JJHe, XJin, YLee, CCMichellys, PYUno, TLiu, H Syk inhibitors with high potency in presence of blood. Bioorg Med Chem Lett24:2278-82 (2014) 
 
Tyrosine-protein kinase ZAP-70
Name:Tyrosine-protein kinase ZAP-70
Type:Enzyme
Mol. Mass.:69881.61
Organism:Homo sapiens (Human)
Description:ZAP-70 SH2 domain was expressed and purified from E. coli using O-phospho-L-tyrosine-agarose column.
Residue:619
BDBM50013160
NameBDBM50013160
Synonyms:CHEMBL3262355
TypeSmall organic molecule
Emp. Form.C21H23N9O
Mol. Mass.417.467
SMILESN[C@H]1CCCC[C@H]1Nc1cc2nc[nH]c(=O)c2c(Nc2cccc(c2)-n2nccn2)n1