Reaction Details
TargetTyrosine-protein kinase ZAP-70
LigandBDBM50013167
Substrate/Competitorn/a
Meas. Tech.ChEMBL_1348046 (CHEMBL3268710)
IC50 445±n/a nM
Citation Thoma, GBlanz, JBühlmayer, PDrückes, PKittelmann, MSmith, ABvan Eis, MVangrevelinghe, EZerwes, HGChe, JJHe, XJin, YLee, CCMichellys, PYUno, TLiu, H Syk inhibitors with high potency in presence of blood. Bioorg Med Chem Lett24:2278-82 (2014) 
 
Tyrosine-protein kinase ZAP-70
Name:Tyrosine-protein kinase ZAP-70
Type:Enzyme
Mol. Mass.:69881.61
Organism:Homo sapiens (Human)
Description:ZAP-70 SH2 domain was expressed and purified from E. coli using O-phospho-L-tyrosine-agarose column.
Residue:619
BDBM50013167
NameBDBM50013167
Synonyms:CHEMBL3262618
TypeSmall organic molecule
Emp. Form.C18H19N7O
Mol. Mass.349.3898
SMILESC[C@H](N)CNc1cc2nc[nH]c(=O)c2c(Nc2cccc3cc[nH]c23)n1