Reaction Details
TargetTyrosine-protein kinase ZAP-70
LigandBDBM50013168
Substrate/Competitorn/a
Meas. Tech.ChEMBL_1348046 (CHEMBL3268710)
IC50 3000±n/a nM
Citation Thoma, GBlanz, JBühlmayer, PDrückes, PKittelmann, MSmith, ABvan Eis, MVangrevelinghe, EZerwes, HGChe, JJHe, XJin, YLee, CCMichellys, PYUno, TLiu, H Syk inhibitors with high potency in presence of blood. Bioorg Med Chem Lett24:2278-82 (2014) 
 
Tyrosine-protein kinase ZAP-70
Name:Tyrosine-protein kinase ZAP-70
Type:Enzyme
Mol. Mass.:69881.61
Organism:Homo sapiens (Human)
Description:ZAP-70 SH2 domain was expressed and purified from E. coli using O-phospho-L-tyrosine-agarose column.
Residue:619
BDBM50013168
NameBDBM50013168
Synonyms:CHEMBL3262619
TypeSmall organic molecule
Emp. Form.C20H21N7O
Mol. Mass.375.427
SMILESO=c1[nH]cnc2cc(N[C@@H]3CCCNC3)nc(Nc3cccc4cc[nH]c34)c12