Reaction Details
TargetTyrosine-protein kinase JAK2
LigandBDBM50013167
Substrate/Competitorn/a
Meas. Tech.ChEMBL_1348047 (CHEMBL3268711)
IC50 980±n/a nM
Citation Thoma, GBlanz, JBühlmayer, PDrückes, PKittelmann, MSmith, ABvan Eis, MVangrevelinghe, EZerwes, HGChe, JJHe, XJin, YLee, CCMichellys, PYUno, TLiu, H Syk inhibitors with high potency in presence of blood. Bioorg Med Chem Lett24:2278-82 (2014) 
 
Tyrosine-protein kinase JAK2
Name:Tyrosine-protein kinase JAK2
Type:Protein
Mol. Mass.:130684.68
Organism:Homo sapiens (Human)
Description:O60674
Residue:1132
BDBM50013167
NameBDBM50013167
Synonyms:CHEMBL3262618
TypeSmall organic molecule
Emp. Form.C18H19N7O
Mol. Mass.349.3898
SMILESC[C@H](N)CNc1cc2nc[nH]c(=O)c2c(Nc2cccc3cc[nH]c23)n1