Reaction Details
TargetReceptor-type tyrosine-protein kinase FLT3
LigandBDBM50013161
Substrate/Competitorn/a
Meas. Tech.ChEMBL_1348058 (CHEMBL3268722)
IC50 20±n/a nM
Citation Thoma, GBlanz, JBühlmayer, PDrückes, PKittelmann, MSmith, ABvan Eis, MVangrevelinghe, EZerwes, HGChe, JJHe, XJin, YLee, CCMichellys, PYUno, TLiu, H Syk inhibitors with high potency in presence of blood. Bioorg Med Chem Lett24:2278-82 (2014) 
 
Receptor-type tyrosine-protein kinase FLT3
Name:Receptor-type tyrosine-protein kinase FLT3
Type:Enzyme
Mol. Mass.:112888.62
Organism:Homo sapiens (Human)
Description:P36888
Residue:993
BDBM50013161
NameBDBM50013161
Synonyms:CHEMBL3262356
TypeSmall organic molecule
Emp. Form.C21H23N7O
Mol. Mass.389.4536
SMILESN[C@H]1CCCC[C@H]1Nc1cc2nc[nH]c(=O)c2c(Nc2cccc3cc[nH]c23)n1