Reaction Details
TargetC-C chemokine receptor type 5
LigandBDBM50013320
Substrate/Competitorn/a
Meas. Tech.ChEMBL_1348510 (CHEMBL3267152)
IC50 45900±n/a nM
Citation Arnatt, CKAdams, JLZhang, ZHaney, KMLi, GZhang, Y Design, syntheses, and characterization of piperazine based chemokine receptor CCR5 antagonists as anti prostate cancer agents. Bioorg Med Chem Lett24:2319-23 (2014) 
 
C-C chemokine receptor type 5
Name:C-C chemokine receptor type 5
Type:Enzyme
Mol. Mass.:40540.21
Organism:Homo sapiens (Human)
Description:P51681
Residue:352
BDBM50013320
NameBDBM50013320
Synonyms:CHEMBL3263034
TypeSmall organic molecule
Emp. Form.C26H31N5O2
Mol. Mass.445.5566
SMILESCC(C)Oc1ccc(cc1NC(=O)c1cnccn1)N1CCN(Cc2ccc(C)cc2)CC1