Reaction Details
TargetMineralocorticoid receptor
LigandBDBM50324210
Substrate/Competitorn/a
Meas. Tech.ChEMBL_1348997 (CHEMBL3265995)
IC50 9.0±n/a nM
Citation Casimiro-Garcia, APiotrowski, DWAmbler, CArhancet, GBBanker, MEBanks, TBoustany-Kari, CMCai, CChen, XEudy, RHepworth, DHulford, CAJennings, SMLoria, PMMeyers, MJPetersen, DNRaheja, NKSammons, MShe, LSong, KVrieze, DWei, L Identification of (R)-6-(1-(4-cyano-3-methylphenyl)-5-cyclopentyl-4,5-dihydro-1H-pyrazol-3-yl)-2-methoxynicotinic acid, a highly potent and selective nonsteroidal mineralocorticoid receptor antagonist. J Med Chem57:4273-88 (2014) 
 
Mineralocorticoid receptor
Name:Mineralocorticoid receptor
Type:Enzyme
Mol. Mass.:107076.42
Organism:Homo sapiens (Human)
Description:P08235
Residue:984
BDBM50324210
NameBDBM50324210
Synonyms:(+/-)-(3SR,3aRS)-2-(3-Chloro-4-cyanophenyl)-3-cyclopentyl-3,3a,4,5-tetrahydro-2H-benzo[g]indazole-7-carboxylic Acid CHEMBL1215331
TypeSmall organic molecule
Emp. Form.C24H22ClN3O2
Mol. Mass.419.903
SMILESOC(=O)c1ccc2C3=NN([C@@H](C4CCCC4)[C@H]3CCc2c1)c1ccc(C#N)c(Cl)c1