Reaction Details
TargetCyclin-T1/Cyclin-dependent kinase 9
LigandBDBM50013490
Substrate/Competitorn/a
Meas. Tech.ChEMBL_1349151 (CHEMBL3267548)
IC50 212±n/a nM
Citation Németh, GGreff, ZSipos, AVarga, ZSzékely, RSebestyén, MJászay, ZBéni, SNemes, ZPirat, JLVolle, JNVirieux, DGyuris, ÁKelemenics, KAy, EMinarovits, JSzathmary, SKéri, GOrfi, L Synthesis and evaluation of phosphorus containing, specific CDK9/CycT1 inhibitors. J Med Chem57:3939-65 (2014) 
 
Cyclin-T1/Cyclin-dependent kinase 9
Name:Cyclin-T1/Cyclin-dependent kinase 9
Type:Protein Complex
Mol. Mass.:n/a
Description:n/a
Components:This complex has 2 components.
Component 1
Name:Cyclin-T1
Synonyms:CCNT1 CycT Cyclin T Cyclin-T
Type:Enzyme Subunit
Mol. Mass.:80712.40
Organism:Homo sapiens (Human)
Description:n/a
Residue:726
Component 2
Name:Cyclin-dependent kinase 9
Synonyms:C-2K CDK9 Cell division cycle 2-like protein kinase 4 Cyclin-Dependent Kinase 9 (CDK9) Serine/threonine-protein kinase PITALRE Tat-associated kinase complex catalytic subunit
Type:Enzyme Subunit
Mol. Mass.:42789.13
Organism:Homo sapiens (Human)
Description:n/a
Residue:372
BDBM50013490
NameBDBM50013490
Synonyms:CHEMBL3264157
TypeSmall organic molecule
Emp. Form.C28H30N3O3P
Mol. Mass.487.5299
SMILESCCOP(=O)(CC)Cc1cccc(Nc2cc(ncn2)-c2ccccc2OCc2ccccc2)c1