Reaction Details
TargetCyclin-T1/Cyclin-dependent kinase 9
LigandBDBM50013509
Substrate/Competitorn/a
Meas. Tech.ChEMBL_1349149 (CHEMBL3267546)
IC50 30±n/a nM
Citation Németh, GGreff, ZSipos, AVarga, ZSzékely, RSebestyén, MJászay, ZBéni, SNemes, ZPirat, JLVolle, JNVirieux, DGyuris, ÁKelemenics, KAy, EMinarovits, JSzathmary, SKéri, GOrfi, L Synthesis and evaluation of phosphorus containing, specific CDK9/CycT1 inhibitors. J Med Chem57:3939-65 (2014) 
 
Cyclin-T1/Cyclin-dependent kinase 9
Name:Cyclin-T1/Cyclin-dependent kinase 9
Type:Protein Complex
Mol. Mass.:n/a
Description:n/a
Components:This complex has 2 components.
Component 1
Name:Cyclin-T1
Synonyms:CCNT1 CycT Cyclin T Cyclin-T
Type:Enzyme Subunit
Mol. Mass.:80712.40
Organism:Homo sapiens (Human)
Description:n/a
Residue:726
Component 2
Name:Cyclin-dependent kinase 9
Synonyms:C-2K CDK9 Cell division cycle 2-like protein kinase 4 Cyclin-Dependent Kinase 9 (CDK9) Serine/threonine-protein kinase PITALRE Tat-associated kinase complex catalytic subunit
Type:Enzyme Subunit
Mol. Mass.:42789.13
Organism:Homo sapiens (Human)
Description:n/a
Residue:372
BDBM50013509
NameBDBM50013509
Synonyms:CHEMBL3263770
TypeSmall organic molecule
Emp. Form.C19H20N4O3S
Mol. Mass.384.452
SMILESCOc1ccccc1-c1cc(Nc2ccc(C)c(NS(C)(=O)=O)c2)ncn1