Reaction Details
TargetVitamin D3 receptor
LigandBDBM50013642
Substrate/Competitorn/a
Meas. Tech.ChEMBL_1349194 (CHEMBL3267968)
IC50 1.6±n/a nM
Citation Anami, YItoh, TEgawa, DYoshimoto, NYamamoto, K A mixed population of antagonist and agonist binding conformers in a single crystal explains partial agonism against vitamin D receptor: active vitamin D analogues with 22R-alkyl group. J Med Chem57:4351-67 (2014) 
 
Vitamin D3 receptor
Name:Vitamin D3 receptor
Type:Protein
Mol. Mass.:48288.72
Organism:Homo sapiens (Human)
Description:P11473
Residue:427
BDBM50013642
NameBDBM50013642
Synonyms:CHEMBL3264169
TypeSmall organic molecule
Emp. Form.C30H50O3
Mol. Mass.458.7162
SMILES[H][C@@]1([#6]-[#6][C@@]2([H])\[#6](-[#6]-[#6]-[#6][C@]12[#6])=[#6]\[#6]=[#6]-1/[#6]-[#6@@H](-[#8])-[#6](=[#6])-[#6@H](-[#8])-[#6]-1)[#6@H](-[#6])-[#6@H](-[#6]-[#6])-[#6]C([#8])([#6]-[#6])[#6]-[#6]