Reaction Details
TargetBotulinum neurotoxin type A
LigandBDBM50013659
Substrate/Competitorn/a
Meas. Tech.ChEMBL_1349201 (CHEMBL3267975)
Ki 3450±n/a nM
Citation Videnovic, MOpsenica, DMBurnett, JCGomba, LNuss, JESelakovic, ZKonstantinovic, JKrstic, MSegan, SZlatovic, MSciotti, RJBavari, SSolaja, BA Second generation steroidal 4-aminoquinolines are potent, dual-target inhibitors of the botulinum neurotoxin serotype A metalloprotease and P. falciparum malaria. J Med Chem57:4134-53 (2014) 
 
Botulinum neurotoxin type A
Name:Botulinum neurotoxin type A
Type:PROTEIN
Mol. Mass.:149450.01
Organism:Clostridium botulinum
Description:ChEMBL_1510137
Residue:1296
BDBM50013659
NameBDBM50013659
Synonyms:CHEMBL3264500
TypeSmall organic molecule
Emp. Form.C40H59ClN4O4
Mol. Mass.695.374
SMILES[H][C@@]1(CC[C@@]2([H])[C@]3([H])[C@@H](C[C@]4([H])C[C@H](N)CC[C@]4(C)[C@@]3([H])C[C@H](OC(C)=O)[C@]12C)OC(C)=O)[C@H](C)CCCNCCCNc1ccnc2cc(Cl)ccc12