Reaction Details
TargetBotulinum neurotoxin type A
LigandBDBM50447108
Substrate/Competitorn/a
Meas. Tech.ChEMBL_1349201 (CHEMBL3267975)
IC50 150±n/a nM
Citation Videnovic, MOpsenica, DMBurnett, JCGomba, LNuss, JESelakovic, ZKonstantinovic, JKrstic, MSegan, SZlatovic, MSciotti, RJBavari, SSolaja, BA Second generation steroidal 4-aminoquinolines are potent, dual-target inhibitors of the botulinum neurotoxin serotype A metalloprotease and P. falciparum malaria. J Med Chem57:4134-53 (2014) 
 
Botulinum neurotoxin type A
Name:Botulinum neurotoxin type A
Type:PROTEIN
Mol. Mass.:149450.01
Organism:Clostridium botulinum
Description:ChEMBL_1510137
Residue:1296
BDBM50447108
NameBDBM50447108
Synonyms:CHEMBL3112881
TypeSmall organic molecule
Emp. Form.C11H7ClFNO2S
Mol. Mass.271.695
SMILESONC(=O)\C=C\c1sc2cc(F)ccc2c1Cl