Reaction Details
TargetBotulinum neurotoxin type A
LigandBDBM50013668
Substrate/Competitorn/a
Meas. Tech.ChEMBL_1349201 (CHEMBL3267975)
Ki 5670±n/a nM
Citation Videnovic, MOpsenica, DMBurnett, JCGomba, LNuss, JESelakovic, ZKonstantinovic, JKrstic, MSegan, SZlatovic, MSciotti, RJBavari, SSolaja, BA Second generation steroidal 4-aminoquinolines are potent, dual-target inhibitors of the botulinum neurotoxin serotype A metalloprotease and P. falciparum malaria. J Med Chem57:4134-53 (2014) 
 
Botulinum neurotoxin type A
Name:Botulinum neurotoxin type A
Type:PROTEIN
Mol. Mass.:149450.01
Organism:Clostridium botulinum
Description:ChEMBL_1510137
Residue:1296
BDBM50013668
NameBDBM50013668
Synonyms:CHEMBL3264171
TypeSmall organic molecule
Emp. Form.C42H60ClN3O6
Mol. Mass.738.395
SMILES[H][C@@]1(CC[C@@]2([H])[C@]3([H])[C@@H](C[C@]4([H])C[C@@H](CC[C@]4(C)[C@@]3([H])C[C@H](OC(C)=O)[C@]12C)OC(C)=O)OC(C)=O)[C@H](C)CCCNCCCNc1ccnc2cc(Cl)ccc12