Reaction Details
TargetPeroxisome proliferator-activated receptor alpha
LigandBDBM50013736
Substrate/Competitorn/a
Meas. Tech.ChEMBL_1349374 (CHEMBL3269597)
IC50 6.6±n/a nM
Citation Bravo, YBaccei, CSBroadhead, ABundey, RChen, AClark, RCorrea, LJacintho, JDLorrain, DSMessmer, DStebbins, KPrasit, PStock, N Identification of the first potent, selective and bioavailable PPARa antagonist. Bioorg Med Chem Lett24:2267-72 (2014) 
 
Peroxisome proliferator-activated receptor alpha
Name:Peroxisome proliferator-activated receptor alpha
Type:Enzyme
Mol. Mass.:52222.08
Organism:Homo sapiens (Human)
Description:Q07869
Residue:468
BDBM50013736
NameBDBM50013736
Synonyms:CHEMBL3264926
TypeSmall organic molecule
Emp. Form.C31H42N4O5S
Mol. Mass.582.754
SMILESCCn1c(CCCc2ccc(OC(C)(C)C(=O)NS(=O)(=O)C3CC3)cc2)nn(Cc2ccc(cc2)C(C)(C)C)c1=O