Reaction Details
TargetApoptosis regulator Bcl-2
LigandBDBM50013867
Substrate/Competitorn/a
Meas. Tech.ChEMBL_1349704 (CHEMBL3266888)
Ki 7560±n/a nM
Citation Abulwerdi, FALiao, CMady, ASGavin, JShen, CCierpicki, TStuckey, JAShowalter, HDNikolovska-Coleska, Z 3-Substituted-N-(4-hydroxynaphthalen-1-yl)arylsulfonamides as a novel class of selective Mcl-1 inhibitors: structure-based design, synthesis, SAR, and biological evaluation. J Med Chem57:4111-33 (2014) 
 
Apoptosis regulator Bcl-2
Name:Apoptosis regulator Bcl-2
Type:Homodimer or heterodimer
Mol. Mass.:26269.11
Organism:Homo sapiens (Human)
Description:P10415
Residue:239
BDBM50013867
NameBDBM50013867
Synonyms:CHEMBL3265299
TypeSmall organic molecule
Emp. Form.C24H19NO6S2
Mol. Mass.481.541
SMILESOC(=O)CSc1cc(NS(=O)(=O)c2ccc(Oc3ccccc3)cc2)c2ccccc2c1O