Reaction Details
TargetBcl-2-like protein 2
LigandBDBM53290
Substrate/Competitorn/a
Meas. Tech.ChEMBL_1349705 (CHEMBL3266889)
Ki 8190±n/a nM
Citation Abulwerdi, FALiao, CMady, ASGavin, JShen, CCierpicki, TStuckey, JAShowalter, HDNikolovska-Coleska, Z 3-Substituted-N-(4-hydroxynaphthalen-1-yl)arylsulfonamides as a novel class of selective Mcl-1 inhibitors: structure-based design, synthesis, SAR, and biological evaluation. J Med Chem57:4111-33 (2014) 
 
Bcl-2-like protein 2
Name:Bcl-2-like protein 2
Type:Protein
Mol. Mass.:20742.61
Organism:Homo sapiens (Human)
Description:n/a
Residue:193
BDBM53290
NameBDBM53290
Synonyms:2-[4-[(4-bromophenyl)sulfonylamino]-1-hydroxynaphthalen-2-yl]sulfanylacetic acid 2-[[4-(brosylamino)-1-hydroxy-2-naphthyl]thio]acetic acid MLS001196198 [(4-{[(4-bromophenyl)sulfonyl]amino}-1-hydroxy-2-naphthyl)thio]acetic acid | cid_992586
TypeSmall organic molecule
Emp. Form.C18H14BrNO5S2
Mol. Mass.468.341
SMILESOC(=O)CSc1cc(NS(=O)(=O)c2ccc(Br)cc2)c2ccccc2c1O