Reaction Details
TargetD-alanyl-D-alanine dipeptidase
LigandBDBM50014161
Substrate/Competitorn/a
Meas. Tech.ChEMBL_1350288 (CHEMBL3267626)
Ki 2740±n/a nM
Citation Muthyala, RRastogi, NShin, WSPeterson, MLSham, YY Cell permeable vanX inhibitors as vancomycin re-sensitizing agents. Bioorg Med Chem Lett24:2535-8 (2014) 
 
D-alanyl-D-alanine dipeptidase
Name:D-alanyl-D-alanine dipeptidase
Type:PROTEIN
Mol. Mass.:23377.40
Organism:Enterococcus faecium
Description:ChEMBL_1350288
Residue:202
BDBM50014161
NameBDBM50014161
Synonyms:CHEMBL3260858 | US11491146, Compound 5
TypeSmall organic molecule
Emp. Form.C14H12N2O4S
Mol. Mass.304.321
SMILESOC(=O)[C@H](NC(=O)c1cccc(=S)n1O)c1ccccc1