Reaction Details
TargetDual specificity mitogen-activated protein kinase kinase 1
LigandBDBM50337926
Substrate/Competitorn/a
Meas. Tech.ChEMBL_1350727 (CHEMBL3266112)
IC50 1.8±n/a nM
Citation Lu, HTu, WFei, HXu, GHu, QZhang, LLin, BYuan, JYin, JGong, AWan, MWang, DZhu, XFeng, JWang, QSun, P Structure-based design and synthesis of bicyclic fused-pyridines as MEK inhibitors. Bioorg Med Chem Lett24:2555-9 (2014) 
 
Dual specificity mitogen-activated protein kinase kinase 1
Name:Dual specificity mitogen-activated protein kinase kinase 1
Type:Other Protein Type
Mol. Mass.:43439.03
Organism:Homo sapiens (Human)
Description:Full-length human MEK-1 was generated by PCR and purified as a fusion protein from Escherichia coli lysates.
Residue:393
BDBM50337926
NameBDBM50337926
Synonyms:(R)-3-(2,3-dihydroxypropyl)-6-fluoro-5-(2-fluoro-4-iodophenylamino)-8-methylpyrido[2,3-d]pyrimidine-4,7(3H,8H)-dione CHEMBL1615025 | US8470837, 18
TypeSmall organic molecule
Emp. Form.C17H15F2IN4O4
Mol. Mass.504.2267
SMILESCn1c2ncn(C[C@@H](O)CO)c(=O)c2c(Nc2ccc(I)cc2F)c(F)c1=O