Reaction Details
TargetGlucocorticoid receptor
LigandBDBM50014439
Substrate/Competitorn/a
Meas. Tech.ChEMBL_1350746 (CHEMBL3266131)
IC50 4.6±n/a nM
Citation Edman, KAhlgren, RBengtsson, MBladh, HBäckström, SDahmén, JHenriksson, KHillertz, PHulikal, VJerre, AKinchin, LKåse, CLepistö, MMile, INilsson, SSmailagic, ATaylor, JTjörnebo, AWissler, LHansson, T The discovery of potent and selective non-steroidal glucocorticoid receptor modulators, suitable for inhalation. Bioorg Med Chem Lett24:2571-7 (2014) 
 
Glucocorticoid receptor
Name:Glucocorticoid receptor
Type:Enzyme
Mol. Mass.:85656.87
Organism:Homo sapiens (Human)
Description:P04150
Residue:777
BDBM50014439
NameBDBM50014439
Synonyms:CHEMBL3261420
TypeSmall organic molecule
Emp. Form.C26H28FN3O2S
Mol. Mass.465.583
SMILESC[C@@H](CCc1cccc2n(ncc12)-c1ccc(F)cc1)NS(=O)(=O)c1c(C)cc(C)cc1C