Reaction Details
Target5-hydroxytryptamine receptor 3A
LigandBDBM50014548
Substrate/Competitorn/a
Meas. Tech.ChEMBL_1350968 (CHEMBL3268497)
Ki 3.1±n/a nM
Citation Manning, DDGuo, CZhang, ZRyan, KNNaginskaya, JChoo, SHMasih, LEarley, WGWierschke, JDNewman, ASBrady, CABarnes, NMGuzzo, PR The discovery of diazepinone-based 5-HT3 receptor partial agonists. Bioorg Med Chem Lett24:2578-81 (2014) 
 
5-hydroxytryptamine receptor 3A
Name:5-hydroxytryptamine receptor 3A
Type:Protein
Mol. Mass.:55283.27
Organism:Homo sapiens (Human)
Description:P46098
Residue:478
BDBM50014548
NameBDBM50014548
Synonyms:CHEMBL3261479 | US9045501, 2
TypeSmall organic molecule
Emp. Form.C18H21N3O
Mol. Mass.295.3788
SMILESO=C1N(CCn2ccc3cccc1c23)[C@@H]1CN2CCC1CC2