Reaction Details
TargetArylamine N-acetyltransferase 2
LigandBDBM50014986
Substrate/Competitorn/a
Meas. Tech.ChEMBL_1347887 (CHEMBL3267123)
IC50 270±n/a nM
Citation Egleton, JEThinnes, CCSeden, PTLaurieri, NLee, SPHadavizadeh, KSMeasures, ARJones, AMThompson, SVarney, AWynne, GMRyan, ASim, ERussell, AJ Structure-activity relationships and colorimetric properties of specific probes for the putative cancer biomarker human arylamine N-acetyltransferase 1. Bioorg Med Chem22:3030-54 (2014) 
 
Arylamine N-acetyltransferase 2
Name:Arylamine N-acetyltransferase 2
Type:PROTEIN
Mol. Mass.:33697.98
Organism:Mus musculus
Description:ChEMBL_1347887
Residue:290
BDBM50014986
NameBDBM50014986
Synonyms:CHEMBL3262086
TypeSmall organic molecule
Emp. Form.C22H17N3O4S
Mol. Mass.419.453
SMILESNc1cccc2C(=O)C(Nc3ccccc3)=C(NS(=O)(=O)c3ccccc3)C(=O)c12