Reaction Details
TargetDelta-type opioid receptor
LigandBDBM50014995
Substrate/Competitorn/a
Meas. Tech.ChEMBL_1347895 (CHEMBL3267131)
Ki 2.6±n/a nM
Citation Kumar, VRidzwan, IEGrivas, KLewis, JWClark, MJMeurice, CJimenez-Gomez, CPogozheva, IMosberg, HTraynor, JRHusbands, SM Selectively promiscuous opioid ligands: discovery of high affinity/low efficacy opioid ligands with substantial nociceptin opioid peptide receptor affinity. J Med Chem57:4049-57 (2014) 
 
Delta-type opioid receptor
Name:Delta-type opioid receptor
Type:G Protein-Coupled Receptor (GPCR)
Mol. Mass.:40382.98
Organism:Homo sapiens (Human)
Description:Competition binding assays were carried out using membrane preparations from transfected HN9.10 cells that constitutively expressed the delta opioid receptor.
Residue:372
BDBM50014995
NameBDBM50014995
Synonyms:CHEMBL3262090 US9480684, 13a, R = Ph- BU126
TypeSmall organic molecule
Emp. Form.C30H35NO4
Mol. Mass.473.6032
SMILES[H][C@@]12Oc3c4c(C[C@@]5([H])N(CC6CC6)CC[C@@]14[C@@]51CC[C@@]2(OC)[C@]([H])(C1)[C@H](O)c1ccccc1)ccc3O