Reaction Details
TargetMu-type opioid receptor
LigandBDBM50014998
Substrate/Competitorn/a
Meas. Tech.ChEMBL_1347893 (CHEMBL3267129)
Ki 3.2±n/a nM
Citation Kumar, VRidzwan, IEGrivas, KLewis, JWClark, MJMeurice, CJimenez-Gomez, CPogozheva, IMosberg, HTraynor, JRHusbands, SM Selectively promiscuous opioid ligands: discovery of high affinity/low efficacy opioid ligands with substantial nociceptin opioid peptide receptor affinity. J Med Chem57:4049-57 (2014) 
 
Mu-type opioid receptor
Name:Mu-type opioid receptor
Type:G Protein-Coupled Receptor (GPCR)
Mol. Mass.:44789.51
Organism:Homo sapiens (Human)
Description:P35372
Residue:400
BDBM50014998
NameBDBM50014998
Synonyms:CHEMBL3262361
TypeSmall organic molecule
Emp. Form.C32H37NO4
Mol. Mass.499.6405
SMILES[H][C@@]12Oc3c4c(C[C@@]5([H])N(CC6CC6)CC[C@@]14[C@]51C[C@]([H])([C@@](O)(CC)c4ccccc4)[C@]2(OC)C=C1)ccc3O