Reaction Details
TargetNociceptin receptor
LigandBDBM50015000
Substrate/Competitorn/a
Meas. Tech.ChEMBL_1348094 (CHEMBL3269123)
Ki 4630±n/a nM
Citation Kumar, VRidzwan, IEGrivas, KLewis, JWClark, MJMeurice, CJimenez-Gomez, CPogozheva, IMosberg, HTraynor, JRHusbands, SM Selectively promiscuous opioid ligands: discovery of high affinity/low efficacy opioid ligands with substantial nociceptin opioid peptide receptor affinity. J Med Chem57:4049-57 (2014) 
 
Nociceptin receptor
Name:Nociceptin receptor
Type:G Protein-Coupled Receptor (GPCR)
Mol. Mass.:40702.87
Organism:Homo sapiens (Human)
Description:P41146
Residue:370
BDBM50015000
NameBDBM50015000
Synonyms:CHEMBL3262377
TypeSmall organic molecule
Emp. Form.C30H36N2O4
Mol. Mass.488.6178
SMILES[H][C@@]12Oc3c4c(C[C@@]5([H])N(CC6CC6)CC[C@@]14[C@@]51CC[C@@]2(OC)[C@]([H])(C1)[C@@](C)(O)c1ccncc1)ccc3O