Reaction Details
TargetDelta-type opioid receptor
LigandBDBM50015007
Substrate/Competitorn/a
Meas. Tech.ChEMBL_1347895 (CHEMBL3267131)
Ki 0.860000±n/a nM
Citation Kumar, VRidzwan, IEGrivas, KLewis, JWClark, MJMeurice, CJimenez-Gomez, CPogozheva, IMosberg, HTraynor, JRHusbands, SM Selectively promiscuous opioid ligands: discovery of high affinity/low efficacy opioid ligands with substantial nociceptin opioid peptide receptor affinity. J Med Chem57:4049-57 (2014) 
 
Delta-type opioid receptor
Name:Delta-type opioid receptor
Type:G Protein-Coupled Receptor (GPCR)
Mol. Mass.:40382.98
Organism:Homo sapiens (Human)
Description:Competition binding assays were carried out using membrane preparations from transfected HN9.10 cells that constitutively expressed the delta opioid receptor.
Residue:372
BDBM50015007
NameBDBM50015007
Synonyms:CHEMBL3262088
TypeSmall organic molecule
Emp. Form.C30H43NO4
Mol. Mass.481.6667
SMILES[H][C@@]12Oc3c4c(C[C@@]5([H])N(CC6CC6)CC[C@@]14[C@@]51CC[C@@]2(OC)[C@]([H])(C1)[C@@](O)(CC)C(C)(C)C)ccc3O